{"text_format":"1","workbook":"xlsx","n_sheets":9,"sheets":["Guidance for agencies","Summary and sign-off","Travel","Hospitality","All other expenses","Gifts and benefits","Transactions","Sheet1","Journalling items"],"not_rendered":{"charts":0,"images":0,"macros":0,"external_links":0,"defined_names":9,"comments":5,"pivot_tables":0},"unopened":[],"bounds":{"document_bytes":16777216,"sheet_cells":100000,"rows_first":2000,"rows_last":500,"rows_between":2000,"halvings":0,"cell_chars":16384,"cell_head_chars":4096},"cells_cut":0,"cells_raw":0,"read":"whole","date_system":"1900"}

{"sheet":"Guidance for agencies","index":0,"n_rows":58,"n_cols":2,"rows_kept":58,"cut":false,"hidden":false,"merged":[]}
["Secretary and Chief Executive Expense Disclosures: A Guide for Agency Staff"]
["The following is a summary from \"Public Service Secretaries and Chief Executive Expense Disclosures: A Guide for Agency Staff\"\nPlease read that in full first."]
[]
["In the following worksheets, cells shaded light green require input. All other cells are locked to prevent change."]
[]
["Purpose"]
["The purpose of regular public disclosure of secretaries and/or chief executive's expenses is to provide transparency and accountability for discretionary expenditure by Public Service agencies and statutory Crown entities."]
["Publishing clear and detailed disclosures is integral to building and maintaining the public's trust and confidence in the Public service."]
[]
["What is covered?","Description\n(e.g. event tickets, etc)"]
["All expenses for items offered, accepted or declined by secretaries or chief executives in performing their role are required to be disclosed, whether paid by credit card or invoiced."]
["This includes expenses for more personal undertakings, such as professional development expenditure, in addition to outgoings for the likes of travel and entertainment. "]
["Secretary and chief executive expenses are not generally regarded as personal or commercially sensitive. Refer to the Ombudsman Guide to Chief Executive Expenses for guidance."]
["Business or corporate expenses for the organisation that are met from the secretaries or chief executive's budget or paid by their credit card are excluded."]
["Expense disclosures cover the full period of the report, and are completed by each secretary or chief executive, including in Acting roles - Complete a separate workbook for each."]
{"$rows_left_out":44}
{"sheet":"Summary and sign-off","index":1,"n_rows":60,"n_cols":6,"rows_kept":60,"cut":false,"hidden":false,"merged":[[8,0,8,5],[6,1,6,5],[5,1,5,5],[0,0,0,5],[1,1,1,5],[2,1,2,5],[3,1,3,5],[4,1,4,5],[7,1,7,5]]}
["Secretary or Chief Executive Expenses, Gifts and Benefits Disclosure - summary & sign-off*"]
["Organisation Name*","Department of Conservation"]
["Secretary or Chief Executive**","Penny Nelson"]
["Disclosure period start***","2022-07-01"]
["Disclosure period end***","2023-06-30"]
["Agency totals check",{"$f":"IF(AND(Travel!B7<>A30,Hospitality!B7<>A30,'All other expenses'!B7<>A30,'Gifts and benefits'!B7<>A30),A31,IF(AND(Travel!B7=A30,Hospitality!B7=A30,'All other expenses'!B7=A30,'Gifts and benefits'!B7=A30),A33,A32))","v":"Data and totals checked on all sheets"}]
["Secretary or Chief Executive approval****","This disclosure has been approved by the Departmental Secretary or Chief Executive"]
["Other sign-off****","Kevin Martin - Chief Financial Officer, Department of Conservation"]
["This summary page updates automatically from the 'Travel', 'Hospitality', 'All other expenses', and 'Gifts and benefits' tabs.\n\nThroughout this workbook, input cells are shaded light green."]
["Summary of expenses","Cost in NZ$","GST inc / exc",null,"Gifts and benefits","Count"]
["Travel expenses",{"$f":"B15+B16+B17","v":21757.439999999999},{"$f":"IF(Travel!B6=\"\",A34,Travel!B6)","v":"Figures exclude GST"},null,"Number offered",{"$f":"'Gifts and benefits'!C25","v":6}]
["Hospitality",{"$f":"Hospitality!B25","v":267.62},{"$f":"IF(Hospitality!B6=\"\",A34,Hospitality!B6)","v":"Figures exclude GST"},null,"Number accepted",{"$f":"'Gifts and benefits'!C26","v":6}]
["Other expenses",{"$f":"'All other expenses'!B25","v":18855.48},{"$f":"IF('All other expenses'!B6=\"\",A34,'All other expenses'!B6)","v":"Figures exclude GST"},null,"Number declined",{"$f":"'Gifts and benefits'!C27","v":0}]
[]
["International Travel",{"$f":"Travel!B25","v":4569.38},{"$f":"C11","v":"Figures exclude GST"}]
{"$rows_left_out":46}
{"sheet":"Travel","index":2,"n_rows":123,"n_cols":5,"rows_kept":123,"cut":false,"hidden":false,"merged":[[6,1,6,4],[4,1,4,4],[111,3,111,4],[0,0,0,4],[26,0,26,4],[95,0,95,4],[1,1,1,4],[2,1,2,4],[3,1,3,4],[7,0,7,4],[8,0,8,4],[5,1,5,4],[24,3,24,4],[93,3,93,4],[9,0,9,4]]}
["Public Service Secretary or Chief Executive Expense Disclosure"]
["Organisation Name ",{"$f":"'Summary and sign-off'!B2:F2","v":"Department of Conservation"}]
["Public Service Secretary or Chief Executive",{"$f":"'Summary and sign-off'!B3:F3","v":"Penny Nelson"}]
["Disclosure period start",{"$f":"'Summary and sign-off'!B4:F4","v":"2022-07-01"}]
["Disclosure period end",{"$f":"'Summary and sign-off'!B5:F5","v":"2023-06-30"}]
["GST on costs","Figures exclude GST"]
["Agency totals check","Data and totals on this worksheet checked and confirmed"]
["International, domestic and local travel expenses"]
["All expenses incurred by Public Service secretary or chief executive during international, domestic and local travel. Group expenses relating to each trip."]
["International Travel    (including travel within NZ at beginning and end of overseas trip)"]
["Date(s)*","Cost in NZ$**","Purpose of travel\n(e.g. attending XYZ conference for 3 days)***","Type of expense\n(e.g. hotel, airfares, taxis, meals & for how many people)","Location(s)"]
[]
[]
["2022-08-03",801.95,"Palm Executive Learning conference and business meetings  4-5 Aug 2022","Accommodation","Brisbane"]
["2022-08-04",208.96,"Palm Executive Learning conference and business meetings  4-5 Aug 2022","Parking","Wellington"]
{"$rows_left_out":109}
{"sheet":"Hospitality","index":3,"n_rows":32,"n_cols":5,"rows_kept":32,"cut":false,"hidden":false,"merged":[[24,3,24,4],[5,1,5,4],[4,1,4,4],[0,0,0,4],[8,0,8,4],[1,1,1,4],[2,1,2,4],[3,1,3,4],[7,0,7,4],[6,1,6,4]]}
["Public Service Secretary or Chief Executive Expense Disclosure"]
["Organisation Name ",{"$f":"'Summary and sign-off'!B2:F2","v":"Department of Conservation"}]
["Public Service Secretary or Chief Executive",{"$f":"'Summary and sign-off'!B3:F3","v":"Penny Nelson"}]
["Disclosure period start",{"$f":"'Summary and sign-off'!B4:F4","v":"2022-07-01"}]
["Disclosure period end",{"$f":"'Summary and sign-off'!B5:F5","v":"2023-06-30"}]
["GST on costs","Figures exclude GST"]
["Agency totals check","Data and totals on this worksheet checked and confirmed"]
["Hospitality Offered to Third Parties*"]
["All hospitality expenses provided by the Public Service secretary or chief executive in the context of their job to anyone external to the Public Service or statutory Crown entities."]
["Date(s)**","Cost in NZ$","Purpose of hospitality\n(e.g. hosting delegation from China, building relationships, team building) ","Type of expense\n(what and for how many e.g. dinner for 5)","Location(s)"]
[]
["2023-03-22",36.96,"Debrief with outgoing Chair Risk and Assurance Committee - Phil Royal","Lunch for two","Wellington"]
["2023-02-28",77.83,"Dinner with Minister Prime","Dinner for one","Wellington"]
["2023-05-23",152.83000000000001,"Dinner with Nga Whenua Chair and Deputy Chair","Dinner for three","Wellington"]
[]
{"$rows_left_out":18}
{"sheet":"All other expenses","index":4,"n_rows":31,"n_cols":5,"rows_kept":31,"cut":false,"hidden":false,"merged":[[24,3,24,4],[5,1,5,4],[4,1,4,4],[6,1,6,4],[0,0,0,4],[1,1,1,4],[2,1,2,4],[3,1,3,4],[8,0,8,4],[7,0,7,4]]}
["Public Service Secretary or Chief Executive Expense Disclosure"]
["Organisation Name ",{"$f":"'Summary and sign-off'!B2:F2","v":"Department of Conservation"}]
["Public Service secretary or Chief Executive",{"$f":"'Summary and sign-off'!B3:F3","v":"Penny Nelson"}]
["Disclosure period start",{"$f":"'Summary and sign-off'!B4:F4","v":"2022-07-01"}]
["Disclosure period end",{"$f":"'Summary and sign-off'!B5:F5","v":"2023-06-30"}]
["GST on costs","Figures exclude GST"]
["Agency totals check","Data and totals on this worksheet checked and confirmed"]
["All Other Expenses"]
["All other expenditure incurred by the Public Service secretary or chief executive that is not travel, hospitality or gifts.\nInclude e.g. phone and data costs, subscriptions, membership fees, conference fees, professional development costs, books and anything else."]
["Date(s)*","Cost in NZ$","Purpose of expense\n(e.g. subscription part of employment agreement, development as agreed with PSC)","Type of expense\n(e.g. phone and data costs, membership fees)","Location(s)"]
[]
["2022-09-14",3999,"Te Hono Aotearoa Bootcamp 14-17 Sept 2022","Professional Development ","Queenstown"]
["2023-06-30",14856.48,"Jeff Whalan Executive Learning Group - Annual Membership Fee","Professional Development ","Australia"]
[]
[]
{"$rows_left_out":17}
{"sheet":"Gifts and benefits","index":5,"n_rows":36,"n_cols":6,"rows_kept":36,"cut":false,"hidden":false,"merged":[[24,4,24,5],[7,0,7,5],[0,0,0,5],[8,0,8,5],[1,1,1,5],[2,1,2,5],[3,1,3,5],[6,1,6,5],[4,1,4,5],[5,1,5,5]]}
["Public Service Secretary or Chief Executive Gifts and Benefits Disclosure"]
["Organisation Name ",{"$f":"'Summary and sign-off'!B2:F2","v":"Department of Conservation"}]
["Public Service Secretary or Chief Executive",{"$f":"'Summary and sign-off'!B3:F3","v":"Penny Nelson"}]
["Disclosure period start",{"$f":"'Summary and sign-off'!B4:F4","v":"2022-07-01"}]
["Disclosure period end",{"$f":"'Summary and sign-off'!B5:F5","v":"2023-06-30"}]
["GST on values","Figures exclude GST"]
["Agency totals check","Data and totals on this worksheet checked and confirmed"]
["Gifts and Benefits over $50 annual value"]
["Include all gifts, invitations to events and other hospitality, of $50 or more in total value per year, offered to the Public Service secretary or chief executive by people external to the Public Service.\nInclude all gifts, invitations or other hospitality whether accepted or declined."]
["Date(s)*","Description\n(e.g. event tickets, etc.)","Was the gift accepted?\n(drop-down list in cell)","Offered by \n(who made the offer?)","Estimated value in NZ$\n(drop-down list in cell but provide specific value if possible)","Other comments\n(e.g. if given to others, whom?)"]
[]
["2022-07-08","Book - \"New Zealand's Wilderness Heritage\" ","Accepted","Les Molloy","Under $100","for DOC library"]
["2022-09-27","Greenstone necklace (for presenting at their conference)","Accepted","NIWA","Under $100"]
["2022-12-05","Framed picture of kereru and small puriri tree","Accepted","Aotearoa Circle","Under $100"]
["2022-12-22","Oval Stone Board","Accepted","Fulton Hogan","Under $100"]
{"$rows_left_out":22}
{"sheet":"Transactions","index":6,"n_rows":355,"n_cols":27,"rows_kept":355,"cut":false,"hidden":true,"merged":[]}
["Sort","Company Code","G/L Account","G/L Account Name","Bus. Transac. Type","Journal Entry","Journal Entry Type","Reference document","Posting Date","Fiscal Year Period","Amount in CC Crcy","reported total","Cost Center","Profit Center","Jrnl.Entry Item Text","DATE","PURPOSE (eg conference attendance)","Type (eg taxi)","Location","Date","Purpose","check","Cancelled dates",null,"On Orbit report"]
[3,"DEPT","62101","Trvl- Domestic Flght","RFBU","100281805","SA","100281805","2022-12-31","006.2023",-461.88,null,"1011915 (DG Expenses)","100000","11191451 Penny Nelson 211202 WLG Air","2022-12-02","Credit for cancelled flight 02 Dec 2021","cancelled",null,"2021-12-02","Removed From Disclosure report 2021/22 expenses",null,211202,null,null,null,{"$f":"K2&O2","v":"-461.8811191451 Penny Nelson 211202 WLG Air"}]
[4,"DEPT","62102","Trvl-Domestic Exp","RFBU","100281805","SA","100281805","2022-12-31","006.2023",81.3,null,"1011915 (DG Expenses)","100000","11230417 Penny Nelson  Extra",null,"Orbit Fees Cancelled Flight 25 Mar 2022","cancelled",null,"2022-03-25","Removed From Disclosure report 2021/22 expenses",null,null,null,null,null,"81.311230417 Penny Nelson  Extra"]
[5,"DEPT","62101","Trvl- Domestic Flght","RFBU","100281805","SA","100281805","2022-12-31","006.2023",-419.04,null,"1011915 (DG Expenses)","100000","11230074 Penny Nelson 220325 WLG Air","2022-03-25","Credit for cancelled flight 25 May 2023","cancelled",null,"2022-03-25","Removed From Disclosure report 2021/22 expenses",null,220325,null,null,null,"-419.0411230074 Penny Nelson 220325 WLG Air"]
[6,"DEPT","62101","Trvl- Domestic Flght","RFBU","100281805","SA","100281805","2022-12-31","006.2023",-813.98,null,"1011915 (DG Expenses)","100000","11230417 Penny Nelson 220325 WLG Air","2022-03-25","Credit for cancelled flight 25 Mar 2022","cancelled",null,"2022-03-25","Removed From Disclosure report 2021/22 expenses",null,220325,null,null,null,"-813.9811230417 Penny Nelson 220325 WLG Air"]
[null,"DEPT","62101","Trvl- Domestic Flght","RFBU","100347168","SA","100347168","2023-06-27","012.2023",-601.03,null,"1011915 (DG Expenses)","100000","11330205 Air Penelope Nelson 2023/05/12",null,null,"cancelled",null,null,"Removed From Disclosure report 2021/22 expenses"]
[null,"DEPT","62101","Trvl- Domestic Flght","RFBU","100347168","SA","100347168","2023-06-27","012.2023",-613.55999999999995,null,"1011915 (DG Expenses)","100000","11383528 Air Penelope Nelson 2023/05/12",null,null,"cancelled",null,null,"Removed From Disclosure report 2021/22 expenses"]
[null,"DEPT","62101","Trvl- Domestic Flght","RFBU","100347168","SA","100347168","2023-06-27","012.2023",-529.25,null,"1011915 (DG Expenses)","100000","11387668 Air Penelope Nelson 2023/04/12",null,null,"cancelled",null,null,"Removed From Disclosure report 2021/22 expenses"]
[null,"DEPT","62103","Trvl-Overseas Exp","RFBU","100347168","SA","100347168","2023-06-27","012.2023",22.4,null,"1011915 (DG Expenses)","100000","11415826 Orbit Fee Penelope Nelson 2023/06/23",null,null,"cancelled",null,null,"Removed From Disclosure report 2021/22 expenses"]
[null,"DEPT","62101","Trvl- Domestic Flght","RFBU","100347168","SA","100347168","2023-06-27","012.2023",-29.51,null,"1011915 (DG Expenses)","100000","11419461 Air Penelope Nelson 2023/04/28",null,null,"cancelled",null,null,"Removed From Disclosure report 2021/22 expenses"]
[null,"DEPT","62102","Trvl-Domestic Exp","RFBU","100347168","SA","100347168","2023-06-27","012.2023",-75.22,null,"1011915 (DG Expenses)","100000","11444913 Other Penelope Nelson 2023/06/12",null,null,"cancelled",null,null,"Removed From Disclosure report 2021/22 expenses"]
[75,"DEPT","62102","Trvl-Domestic Exp","RFBU","100281805","SA","100281805","2022-12-31","006.2023",136.52000000000001,null,"1011915 (DG Expenses)","100000","11254148 Penny Nelson 220603 ZQN Hotel","2022-06-03","Regional Visit - Southern South Island","Airfare","Queenstown","2022-06-03","Removed From Disclosure report 2021/22 expenses",null,null,null,null,null,"136.5211254148 Penny Nelson 220603 ZQN Hotel"]
[76,"DEPT","62102","Trvl-Domestic Exp","RFBU","100281805","SA","100281805","2022-12-31","006.2023",7.5,null,"1011915 (DG Expenses)","100000","11254148 Penny Nelson 220531 Orbit Fee","2022-05-31","Regional Visit - Southern South Island","Airfare","Queenstown","2022-06-03","Removed From Disclosure report 2021/22 expenses",null,null,null,null,null,"7.511254148 Penny Nelson 220531 Orbit Fee"]
[77,"DEPT","62102","Trvl-Domestic Exp","RFBU","100281805","SA","100281805","2022-12-31","006.2023",153.47999999999999,null,"1011915 (DG Expenses)","100000","11254148 Penny Nelson  Extra","2022-05-31","Regional Visit - Southern South Island","Airfare","Queenstown","2022-06-03","Removed From Disclosure report 2021/22 expenses",null,null,null,null,null,"153.4811254148 Penny Nelson  Extra"]
[78,"DEPT","62102","Trvl-Domestic Exp","RFBU","100281805","SA","100281805","2022-12-31","006.2023",65.650000000000006,null,"1011915 (DG Expenses)","100000","11254778 Penny Nelson  Extra","2022-05-31","Regional Visit - Southern South Island","Airfare","Queenstown","2022-06-03","Removed From Disclosure report 2021/22 expenses",null,null,null,null,null,"65.6511254778 Penny Nelson  Extra"]
{"$rows_left_out":341}
{"sheet":"Sheet1","index":7,"n_rows":323,"n_cols":15,"rows_kept":323,"cut":false,"hidden":true,"merged":[]}
["Company Code","G/L Account","G/L Account Name","Bus. Transac. Type","Journal Entry","Journal Entry Type","Reference document","Posting Date","Fiscal Year Period","Amount in CC Crcy","Cost Center","Profit Center","Jrnl.Entry Item Text","check","Check 2"]
["DEPT","62104","Taxi / Cab Services","RFBU","100128810","SA","100128810","2022-09-29","003.2023",36.35,"1011915 (DG Expenses)","100000","Gold Band Taxis PN taxi to airport after Te Hono B",{"$f":"J2&M2","v":"36.35Gold Band Taxis PN taxi to airport after Te Hono B"},{"$f":"MATCH(N2,Transactions!AA:AA,0)","v":46}]
["DEPT","62102","Trvl-Domestic Exp","RFBU","100128810","SA","100128810","2022-09-29","003.2023",130.43,"1011915 (DG Expenses)","100000","Wellington Intl PN: Airport parking (Wgtn) whilst",{"$f":"J3&M3","v":"130.43Wellington Intl PN: Airport parking (Wgtn) whilst"},{"$f":"MATCH(N3,Transactions!AA:AA,0)","v":115}]
["DEPT","62521","Education Costs","RFBU","100128810","SA","100128810","2022-09-29","003.2023",9.3699999999999992,"1011915 (DG Expenses)","100000","Manners Night N SG BIscuits for HSW Governance Boa","9.37Manners Night N SG BIscuits for HSW Governance Boa",{"$f":"MATCH(N4,Transactions!AA:AA,0)","v":{"$error":"#N/A"}}]
["DEPT","62104","Taxi / Cab Services","RFBU","100129339","SA","100129339","2022-09-29","003.2023",-36.35,"1011915 (DG Expenses)","100000","Gold Band Taxis PN taxi to airport after Te Hono B","-36.35Gold Band Taxis PN taxi to airport after Te Hono B",{"$f":"MATCH(N5,Transactions!AA:AA,0)","v":{"$error":"#N/A"}}]
["DEPT","62102","Trvl-Domestic Exp","RFBU","100129339","SA","100129339","2022-09-29","003.2023",-130.43,"1011915 (DG Expenses)","100000","Wellington Intl PN: Airport parking (Wgtn) whilst","-130.43Wellington Intl PN: Airport parking (Wgtn) whilst",{"$f":"MATCH(N6,Transactions!AA:AA,0)","v":{"$error":"#N/A"}}]
["DEPT","62521","Education Costs","RFBU","100129339","SA","100129339","2022-09-29","003.2023",-9.3699999999999992,"1011915 (DG Expenses)","100000","Manners Night N SG BIscuits for HSW Governance Boa","-9.37Manners Night N SG BIscuits for HSW Governance Boa",{"$f":"MATCH(N7,Transactions!AA:AA,0)","v":{"$error":"#N/A"}}]
["DEPT","62104","Taxi / Cab Services","RFBU","100129341","SA","100129341","2022-09-29","003.2023",36.35,"1011915 (DG Expenses)","100000","Gold Band Taxis PN taxi to airport after Te Hono B","36.35Gold Band Taxis PN taxi to airport after Te Hono B",{"$f":"MATCH(N8,Transactions!AA:AA,0)","v":46}]
["DEPT","62102","Trvl-Domestic Exp","RFBU","100129341","SA","100129341","2022-09-29","003.2023",130.43,"1011915 (DG Expenses)","100000","Wellington Intl PN: Airport parking (Wgtn) whilst","130.43Wellington Intl PN: Airport parking (Wgtn) whilst",{"$f":"MATCH(N9,Transactions!AA:AA,0)","v":115}]
["DEPT","62521","Education Costs","RFBU","100129341","SA","100129341","2022-09-29","003.2023",9.3699999999999992,"1011915 (DG Expenses)","100000","Manners Night N SG BIscuits for HSW Governance Boa","9.37Manners Night N SG BIscuits for HSW Governance Boa",{"$f":"MATCH(N10,Transactions!AA:AA,0)","v":{"$error":"#N/A"}}]
["DEPT","62103","Trvl-Overseas Exp","RFBU","100136361","SA","100136361","2022-10-26","004.2023",1287.01,"1011915 (DG Expenses)","100000","11320214 Penny Nelson 221102 WLG Air","1287.0111320214 Penny Nelson 221102 WLG Air",{"$f":"MATCH(N11,Transactions!AA:AA,0)","v":116}]
["DEPT","62103","Trvl-Overseas Exp","RFBU","100136361","SA","100136361","2022-10-26","004.2023",25.5,"1011915 (DG Expenses)","100000","11320214 Penny Nelson 221102 Orbit Fee","25.511320214 Penny Nelson 221102 Orbit Fee",{"$f":"MATCH(N12,Transactions!AA:AA,0)","v":117}]
["DEPT","62103","Trvl-Overseas Exp","RFBU","100136361","SA","100136361","2022-10-26","004.2023",25.5,"1011915 (DG Expenses)","100000","11320214 Penelope Nelson 221102 Orbit Fee","25.511320214 Penelope Nelson 221102 Orbit Fee",{"$f":"MATCH(N13,Transactions!AA:AA,0)","v":118}]
["DEPT","62103","Trvl-Overseas Exp","RFBU","100136361","SA","100136361","2022-10-26","004.2023",20,"1011915 (DG Expenses)","100000","11320214 Penelope Nelson 220914 Orbit Fee","2011320214 Penelope Nelson 220914 Orbit Fee",{"$f":"MATCH(N14,Transactions!AA:AA,0)","v":119}]
["DEPT","62102","Trvl-Domestic Exp","RFBU","100136362","SA","100136362","2022-10-26","004.2023",16.850000000000001,"1011915 (DG Expenses)","100000","11320955 Penny Nelson 220918 Orbit Fee","16.8511320955 Penny Nelson 220918 Orbit Fee",{"$f":"MATCH(N15,Transactions!AA:AA,0)","v":53}]
{"$rows_left_out":309}
{"sheet":"Journalling items","index":8,"n_rows":103,"n_cols":18,"rows_kept":103,"cut":false,"hidden":true,"merged":[]}
["Journal to DG - Actioned"]
["Company Code","G/L Account","G/L Account Name","Bus. Transac. Type","Journal Entry","Journal Entry Type","Reference document","Posting Date","Fiscal Year Period","Amount in CC Crcy","Cost Center","Profit Center","Jrnl.Entry Item Text","Journal out to DG?"]
["DEPT","62103","Trvl-Overseas Exp","RFBU","100062505","SA","100062505","2022-08-31","002.2023",70.38,"1011905 (Office of the DG)","100000","Gregorski Group PN Dinner in Brisbane - Palm Learn"]
["DEPT","62102","Trvl-Domestic Exp","RFBU","100062505","SA","100062505","2022-08-31","002.2023",46.96,"1011905 (Office of the DG)","100000","Wellington Inte PN Extension to premium carparking"]
["DEPT","62103","Trvl-Overseas Exp","RFBU","100062505","SA","100062505","2022-08-31","002.2023",53.91,"1011905 (Office of the DG)","100000","Sq *priority Tr PN - taxi to Brisbane airport - Pa"]
["DEPT","62102","Trvl-Domestic Exp","RFBU","100062514","SA","100062514","2022-08-31","002.2023",49.57,"1011905 (Office of the DG)","100000","Mint Folk PN - Twizel visit - breakfast 15 J"]
["DEPT","62102","Trvl-Domestic Exp","RFBU","100128810","SA","100128810","2022-09-29","003.2023",22.61,"1011905 (Office of the DG)","100000","The Lucky Club PN meal Tame Malcolm and Penny Nel"]
["DEPT","62102","Trvl-Domestic Exp","RFBU","100129339","SA","100129339","2022-09-29","003.2023",-22.61,"1011905 (Office of the DG)","100000","The Lucky Club PN meal Tame Malcolm and Penny Nel"]
["DEPT","62102","Trvl-Domestic Exp","RFBU","100129341","SA","100129341","2022-09-29","003.2023",22.61,"1011905 (Office of the DG)","100000","The Lucky Club PN meal Tame Malcolm and Penny Nel"]
["DEPT","62103","Trvl-Overseas Exp","RFBU","100129386","SA","100129386","2022-09-30","003.2023",727.1,"1011905 (Office of the DG)","100000","11275227 Penelope Nelson 220803 Brisbane Hotel"]
["DEPT","62103","Trvl-Overseas Exp","RFBU","100129386","SA","100129386","2022-09-30","003.2023",0.5,"1011905 (Office of the DG)","100000","11275227 Penelope Nelson 220803 Orbit Fee"]
["DEPT","62103","Trvl-Overseas Exp","RFBU","100129386","SA","100129386","2022-09-30","003.2023",20,"1011905 (Office of the DG)","100000","11275227 Penelope Nelson 220803 Orbit Fee"]
["DEPT","62102","Trvl-Domestic Exp","RFBU","100129387","SA","100129387","2022-09-30","003.2023",7.5,"1011905 (Office of the DG)","100000","11287719 Penny Nelson 220714 Orbit Fee"]
["DEPT","62102","Trvl-Domestic Exp","RFBU","100129387","SA","100129387","2022-09-30","003.2023",130.43,"1011905 (Office of the DG)","100000","11287719 Penny Nelson 220714 Twizel Hotel"]
["DEPT","62102","Trvl-Domestic Exp","RFBU","100129388","SA","100129388","2022-09-30","003.2023",5.85,"1011905 (Office of the DG)","100000","11299104 Penny Nelson 221012 Orbit Fee"]
{"$rows_left_out":88}